Target
Arginase-1
Ligand
BDBM50538541
Substrate
Meas. Tech.
ChEMBL_1973101 (CHEMBL4605919)
IC50
14±n/a nM
Citation
 Mitcheltree, MJLi, DAchab, ABeard, AChakravarthy, KCheng, MCho, HEangoor, PFan, PGathiaka, SKim, HYLesburg, CALyons, TWMartinot, TAMiller, JRMcMinn, SO'Neil, JPalani, APalte, RLSaurí, JSloman, DLZhang, HCumming, JNFischer, C Discovery and Optimization of Rationally Designed Bicyclic Inhibitors of Human Arginase to Enhance Cancer Immunotherapy. ACS Med Chem Lett 11:582-588 (2020)  
Target
Name:
Arginase-1
Synonyms:
ARG1 Liver-type arginase | Type I arginase
Type:
PROTEIN
Mol. Mass.:
34737.53
Organism:
Homo sapiens (Human)
Description:
ChEMBL_978893
Residue:
322
  
Inhibitor
Name:
BDBM50538541
Synonyms:
CHEMBL4633123
Type:
Small organic molecule
Emp. Form.:
C12H21BFNO5
Mol. Mass.:
289.108
SMILES:
[H][C@@]12C[C@](N)([C@@H](CCCB(O)O)[C@]1([H])C[C@H](O)[C@H]2F)C(O)=O
: