Target
Arginase-1
Ligand
BDBM50538539
Substrate
Meas. Tech.
ChEMBL_1973102 (CHEMBL4605920)
IC50
40±n/a nM
Citation
 Mitcheltree, MJLi, DAchab, ABeard, AChakravarthy, KCheng, MCho, HEangoor, PFan, PGathiaka, SKim, HYLesburg, CALyons, TWMartinot, TAMiller, JRMcMinn, SO'Neil, JPalani, APalte, RLSaurí, JSloman, DLZhang, HCumming, JNFischer, C Discovery and Optimization of Rationally Designed Bicyclic Inhibitors of Human Arginase to Enhance Cancer Immunotherapy. ACS Med Chem Lett 11:582-588 (2020)  
Target
Name:
Arginase-1
Synonyms:
ARG1 Liver-type arginase | Type I arginase
Type:
PROTEIN
Mol. Mass.:
34737.53
Organism:
Homo sapiens (Human)
Description:
ChEMBL_978893
Residue:
322
  
Inhibitor
Name:
BDBM50538539
Synonyms:
CHEMBL4636066
Type:
Small organic molecule
Emp. Form.:
C15H28BN3O5
Mol. Mass.:
341.211
SMILES:
[H][C@]12C[C@@H](C[C@@]1([H])[C@H](CCCB(O)O)[C@@](N)(C2)C(O)=O)NC(=O)[C@H](C)N
: