Target
Beta-2 adrenergic receptor
Ligand
BDBM50538802
Substrate
Meas. Tech.
ChEMBL_1977177 (CHEMBL4610312)
EC50
0.027542±n/a nM
Citation
 Yi, CXing, GWang, SLi, XLiu, YLi, JLin, BWoo, AYZhang, YPan, LCheng, M Design, synthesis and biological evaluation of 8-(2-amino-1-hydroxyethyl)-6-hydroxy-1,4-benzoxazine-3(4H)-one derivatives as potent ? Bioorg Med Chem 28:0 (2020)  
Target
Name:
Beta-2 adrenergic receptor
Synonyms:
ADRB2 ADRB2_HUMAN Beta-2 adrenoceptor | Beta-2 adrenoreceptor
Type:
Mol. Mass.:
46461.69
Organism:
Homo sapiens (Human)
Description:
P07550
Residue:
413
  
Inhibitor
Name:
BDBM50538802
Synonyms:
CHEMBL4641262
Type:
Small organic molecule
Emp. Form.:
C22H29ClN2O5
Mol. Mass.:
436.929
SMILES:
Cl.COc1cccc(CCC(C)(C)NC[C@H](O)c2cc(O)cc3NC(=O)COc23)c1
: