Target
Chromobox protein homolog 1
Ligand
BDBM50155931
Substrate
Meas. Tech.
ChEMBL_1977185 (CHEMBL4610320)
Kd
4750±n/a nM
Citation
 Milosevich, NMcFarlane, JGignac, MCLi, JBrown, TMWilson, CRDevorkin, LCroft, CSHof, RPaci, ILum, JJHof, F Pan-specific and partially selective dye-labeled peptidic inhibitors of the polycomb paralog proteins. Bioorg Med Chem 28:0 (2020)  
Target
Name:
Chromobox protein homolog 1
Synonyms:
CBX CBX1_HUMAN HP1Hsbeta Heterochromatin protein p25 Modifier 1 protein | p25beta
Type:
PROTEIN
Mol. Mass.:
21405.43
Organism:
Homo sapiens (Human)
Description:
ChEMBL_103989
Residue:
185
  
Inhibitor
Name:
BDBM50155931
Synonyms:
CHEMBL3780251
Type:
Small organic molecule
Emp. Form.:
C72H83BrN11O17S
Mol. Mass.:
1486.461
SMILES:
C[C@H](NC(=O)[C@H](Cc1ccccc1)NC(=O)c1ccc(Br)cc1)C(=O)N[C@@H](Cc1ccc(O)cc1)C(=O)N[C@@H](CCCC[N+](C)(C)C)C(=O)N[C@@H](CO)C(=O)N[C@@H](CCC(O)=O)C(=O)N[C@@H](CCCCNC(=S)Nc1ccc(c(c1)C(O)=O)-c1c2ccc(O)cc2oc2cc(=O)ccc12)C(N)=O
: