Target
5-hydroxytryptamine receptor 2A
Ligand
BDBM50095027
Substrate
Meas. Tech.
ChEBML_2274
Ki
0.300000±n/a nM
Citation
 Smith, ALStevenson, GILewis, SPatel, SCastro, JL Solid-phase synthesis of 2,3-disubstituted indoles: discovery of a novel, high-affinity, selective h5-HT2A antagonist. Bioorg Med Chem Lett 10:2693-6 (2000)  
Target
Name:
5-hydroxytryptamine receptor 2A
Synonyms:
5-HT-2 5-HT2A 5-hydroxytryptamine receptor 2A (5HT-2A) 5HT2A_HUMAN HTR2A | Serotonin receptor 2A
Type:
undefined
Mol. Mass.:
52607.65
Organism:
Homo sapiens (Human)
Description:
P28223
Residue:
471
  
Inhibitor
Name:
BDBM50095027
Synonyms:
(2,3-Dimethoxy-phenyl)-{1-[2-(4-fluoro-phenyl)-ethyl]-piperidin-4-yl}-methanol (2,3-Dimethoxy-phenyl)-{1-[2-(4-fluoro-phenyl)-ethyl]-piperidin-4-yl}-methanol(MDL 100907) (R)-(2,3-Dimethoxy-phenyl)-{1-[2-(4-fluoro-phenyl)-ethyl]-piperidin-4-yl}-methanol (R)-(2,3-dimethoxyphenyl)(1-(4-fluorophenethyl)piperidin-4-yl)methanol MDL 100907 | MDL-100907
Type:
Small organic molecule
Emp. Form.:
C22H28FNO3
Mol. Mass.:
373.461
SMILES:
COc1cccc([C@H](O)C2CCN(CCc3ccc(F)cc3)CC2)c1OC
: