Target
C-X-C chemokine receptor type 6
Ligand
BDBM50539453
Substrate
Meas. Tech.
ChEMBL_1978133 (CHEMBL4611268)
IC50
1800±n/a nM
Citation
 Peddibhotla, SHershberger, PMJason Kirby, RSugarman, EMaloney, PRHampton Sessions, EDivlianska, DMorfa, CJTerry, DPinkerton, ABSmith, LHMalany, S Discovery of small molecule antagonists of chemokine receptor CXCR6 that arrest tumor growth in SK-HEP-1 mouse xenografts as a model of hepatocellular carcinoma. Bioorg Med Chem Lett 30:0 (2020)  
Target
Name:
C-X-C chemokine receptor type 6
Synonyms:
BONZO CD_antigen=CD186 CXC-R6 CXCR6 G-protein coupled receptor STRL33 STRL33 | TYMSTR
Type:
PROTEIN
Mol. Mass.:
39289.05
Organism:
Homo sapiens
Description:
ChEMBL_102648
Residue:
342
  
Inhibitor
Name:
BDBM50539453
Synonyms:
CHEMBL4649351
Type:
Small organic molecule
Emp. Form.:
C26H31Cl2N3O5
Mol. Mass.:
536.447
SMILES:
[H][C@]12CCC[C@]([H])(C[C@H](C1)NC(=O)c1cc(OC)c(OC)c(OC)c1)N2CC(=O)Nc1ccc(Cl)c(Cl)c1
: