Target
Endoplasmin
Ligand
BDBM50540240
Substrate
Meas. Tech.
ChEMBL_1981019 (CHEMBL4614281)
IC50
49±n/a nM
Citation
 Jung, SYoon, NGYang, SKim, DLee, WSHong, KBLee, CKang, BHLee, JHKang, S Discovery of 2-((4-resorcinolyl)-5-aryl-1,2,3-triazol-1-yl)acetates as potent Hsp90 inhibitors with selectivity over TRAP1. Bioorg Med Chem Lett 30:0 (2020)  
Target
Name:
Endoplasmin
Synonyms:
94 kDa glucose-regulated protein GRP-94 Glucose regulated protein 94kDa (Grp94) Heat shock protein 90 kDa beta member 1 Tumor rejection antigen 1 | gp96 homolog
Type:
Protein
Mol. Mass.:
92417.36
Organism:
Homo sapiens (Human)
Description:
P14625
Residue:
803
  
Inhibitor
Name:
BDBM50540240
Synonyms:
CHEMBL4647894
Type:
Small organic molecule
Emp. Form.:
C26H32N4O4
Mol. Mass.:
464.5567
SMILES:
COC(=O)Cn1nnc(c1-c1ccc(CN2CCCCC2)cc1)-c1cc(C(C)C)c(O)cc1O
: