Target
Histone acetyltransferase KAT2B
Ligand
BDBM50234942
Substrate
Meas. Tech.
ChEMBL_1982124 (CHEMBL4615386)
IC50
19953±n/a nM
Citation
 Clegg, MABamborough, PChung, CWCraggs, PDGordon, LGrandi, PLeveridge, MLindon, MLiwicki, GMMichon, AMMolnar, JRioja, ISoden, PETheodoulou, NHWerner, TTomkinson, NCOPrinjha, RKHumphreys, PG Application of Atypical Acetyl-lysine Methyl Mimetics in the Development of Selective Inhibitors of the Bromodomain-Containing Protein 7 (BRD7)/Bromodomain-Containing Protein 9 (BRD9) Bromodomains. J Med Chem 63:5816-5840 (2020)  
Target
Name:
Histone acetyltransferase KAT2B
Synonyms:
Histone acetyltransferase KAT2A/KAT2B KAT2B PCAF
Type:
PROTEIN
Mol. Mass.:
93045.76
Organism:
Homo sapiens (Human)
Description:
ChEMBL_1502838
Residue:
832
  
Inhibitor
Name:
BDBM50234942
Synonyms:
CHEMBL4093233
Type:
Small organic molecule
Emp. Form.:
C6H8ClN3O
Mol. Mass.:
173.6
SMILES:
CNc1cnn(C)c(=O)c1Cl
: