Target
CAAX prenyl protease 2
Ligand
BDBM50096862
Substrate
Meas. Tech.
ChEBML_194934
IC50
14000±n/a nM
Citation
 Schlitzer, MWinter-Vann, ACasey, PJ Non-peptidic, non-prenylic inhibitors of the prenyl protein-specific protease Rce1. Bioorg Med Chem Lett 11:425-7 (2001)  
Target
Name:
CAAX prenyl protease 2
Synonyms:
CAAX prenyl protease 2 FACE2 Farnesylated proteins-converting enzyme 2 Prenyl protein-specific endoprotease 2 RCE1 homolog RCE1B | hRCE1
Type:
PROTEIN
Mol. Mass.:
35839.94
Organism:
Homo sapiens (Human)
Description:
ChEMBL_194935
Residue:
329
  
Inhibitor
Name:
BDBM50096862
Synonyms:
(9Z,12Z)-Octadeca-9,12-dienoic acid {2-[3-(2,3-dimethyl-phenylsulfamoyl)-phenylcarbamoyl]-ethyl}-amide | CHEMBL135744
Type:
Small organic molecule
Emp. Form.:
C35H51N3O4S
Mol. Mass.:
609.862
SMILES:
CCCCC\C=C/C\C=C/CCCCCCCC(=O)NCCC(=O)Nc1cccc(c1)S(=O)(=O)Nc1cccc(C)c1C
: