Target
Aromatase
Ligand
BDBM50097367
Substrate
Meas. Tech.
ChEMBL_50716 (CHEMBL666795)
IC50
89±n/a nM
Citation
 Recanatini, MBisi, ACavalli, ABelluti, FGobbi, SRampa, AValenti, PPalzer, MPalusczak, AHartmann, RW A new class of nonsteroidal aromatase inhibitors: design and synthesis of chromone and xanthone derivatives and inhibition of the P450 enzymes aromatase and 17 alpha-hydroxylase/C17,20-lyase. J Med Chem 44:672-80 (2001)  
Target
Name:
Aromatase
Synonyms:
ARO1 CP19A_HUMAN CYP19 CYPXIX Cytochrome P450 19A1 Cytochrome P450-C19 (CYP19) FL cytokine receptor precursor | P-450AROM
Type:
Enzyme
Mol. Mass.:
57888.92
Organism:
Homo sapiens (Human)
Description:
P11511
Residue:
503
  
Inhibitor
Name:
BDBM50097367
Synonyms:
1-Bromo-4-imidazol-1-ylmethyl-xanthen-9-one CHEMBL421829
Type:
Small organic molecule
Emp. Form.:
C17H11BrN2O2
Mol. Mass.:
355.185
SMILES:
Brc1ccc(Cn2ccnc2)c2oc3ccccc3c(=O)c12
: