Target
Beta-glucuronidase
Ligand
BDBM193731
Substrate
Meas. Tech.
ChEMBL_1983575 (CHEMBL4616981)
IC50
5700±n/a nM
Citation
 Awolade, PCele, NKerru, NGummidi, LOluwakemi, ESingh, P Therapeutic significance of ?-glucuronidase activity and its inhibitors: A review. Eur J Med Chem 187:0 (2020)  
Target
Name:
Beta-glucuronidase
Synonyms:
β-Glucuronidase Beta-G1 GUSB | beta-Glucuronidase (β-glucuronidase)
Type:
Protein
Mol. Mass.:
74736.05
Organism:
Homo sapiens (Human)
Description:
Residue:
651
  
Inhibitor
Name:
BDBM193731
Synonyms:
2-(4-(Di(1H-indol-3-yl)methyl)benzoyl)-N-(3-nitrophenyl)hydrazinecarbothioamide (14)
Type:
Small organic molecule
Emp. Form.:
C31H24N6O3S
Mol. Mass.:
560.626
SMILES:
[O-][N+](=O)c1cccc(NC(=S)NNC(=O)c2ccc(cc2)C(c2c[nH]c3ccccc23)c2c[nH]c3ccccc23)c1
: