Target
Protein farnesyltransferase subunit beta/geranylgeranyltransferase type-1 subunit alpha
Ligand
BDBM50097814
Substrate
Meas. Tech.
ChEMBL_141190 (CHEMBL750687)
IC50
20±n/a nM
Citation
 Ohkanda, JLockman, JWYokoyama, KGelb, MHCroft, SLKendrick, HHarrell, MIFeagin, JEBlaskovich, MASebti, SMHamilton, AD Peptidomimetic inhibitors of protein farnesyltransferase show potent antimalarial activity. Bioorg Med Chem Lett 11:761-4 (2001)  
Target
Name:
Protein farnesyltransferase subunit beta/geranylgeranyltransferase type-1 subunit alpha
Synonyms:
Protein farnesyltransferase | Protein farnesyltransferase beta/geranylgeranyltransferase type I alpha subunit
Type:
Mol. Mass.:
Description:
ASSAY_ID of EBI is 38702
Components:
This complex has 2 components.
Component 1
Name:
Protein farnesyltransferase/geranylgeranyltransferase type-1 subunit alpha
Synonyms:
CAAX farnesyltransferase subunit alpha FTase-alpha GGTase-I-alpha Protein farnesyltransferase/geranylgeranyltransferase type-1 subunit alpha Type I protein geranyl-geranyltransferase subunit alpha
Type:
PROTEIN
Mol. Mass.:
43994.09
Organism:
Mus musculus
Description:
EBI_10570
Residue:
377
  
Component 2
Name:
Protein farnesyltransferase subunit beta
Synonyms:
FNTB_MOUSE Protein farnesyltransferase
Type:
PROTEIN
Mol. Mass.:
48811.61
Organism:
Mus musculus
Description:
EBI_12341
Residue:
437
  
Inhibitor
Name:
BDBM50097814
Synonyms:
(S)-2-[(5-{[(1H-Imidazol-4-ylmethyl)-amino]-methyl}-2'-methyl-biphenyl-2-carbonyl)-amino]-4-methylsulfanyl-butyric acid methyl ester | CHEMBL138719
Type:
Small organic molecule
Emp. Form.:
C25H30N4O3S
Mol. Mass.:
466.596
SMILES:
COC(=O)[C@H](CCSC)NC(=O)c1ccc(CNCc2cnc[nH]2)cc1-c1ccccc1C
: