Target
Retinoic acid receptor gamma
Ligand
BDBM50097823
Substrate
Meas. Tech.
ChEMBL_196316 (CHEMBL806259)
IC50
5±n/a nM
Citation
 Beard, RLKlein, ESStandeven, AMEscobar, MChandraratna, RA Phenylcyclohexene and phenylcyclohexadiene substituted compounds having retinoid antagonist activity. Bioorg Med Chem Lett 11:765-8 (2001)  
Target
Name:
Retinoic acid receptor gamma
Synonyms:
NR1B3 RAR-gamma RARG_HUMAN Retinoic acid receptor gamma | Retinoid receptor
Type:
PROTEIN
Mol. Mass.:
50345.43
Organism:
Homo sapiens (Human)
Description:
ChEMBL_1458016
Residue:
454
  
Inhibitor
Name:
BDBM50097823
Synonyms:
4-[(E)-4-(6,6-Dimethyl-2-p-tolyl-cyclohex-1-enyl)-but-3-en-1-ynyl]-benzoic acid | CHEMBL349018
Type:
Small organic molecule
Emp. Form.:
C26H26O2
Mol. Mass.:
370.4834
SMILES:
Cc1ccc(cc1)C1=C(\C=C\C#Cc2ccc(cc2)C(O)=O)C(C)(C)CCC1
: