Target
OXA23 carbapenemase
Ligand
BDBM50089084
Substrate
Meas. Tech.
ChEMBL_1984280 (CHEMBL4617686)
Ki
>40000±n/a nM
Citation
 Hecker, SJReddy, KRLomovskaya, OGriffith, DCRubio-Aparicio, DNelson, KTsivkovski, RSun, DSabet, MTarazi, ZParkinson, JTotrov, MBoyer, SHGlinka, TWPemberton, OAChen, YDudley, MN Discovery of Cyclic Boronic Acid QPX7728, an Ultrabroad-Spectrum Inhibitor of Serine and Metallo-?-lactamases. J Med Chem 63:7491-7507 (2020)  
Target
Name:
OXA23 carbapenemase
Synonyms:
A9843_09540 ABC003_03708 AZE33_05050 AZE33_05150 B4N88_05195 B4O95_06245 B9W69_20755 Beta-lactamase oxa23 C7G90_19950 CBE85_20255 CEJ63_03230 CKN52_19575 CUC59_19845 CUC61_19825 Carbapenemase OXA-23 DLI67_05170 DLI75_05265 DV997_16620 DVA79_19285 E2533_00255 E2538_00225 E4664_15685 EA686_06705 EJB02_18290 FD887_20545 FDF20_00180 FGL68_16065 G3N45_19825 HWQ22_07320 IX87_16825 LV38_03424 NCTC13421_03411 OXA-23 OXA-23 class D beta-lactamase SAMEA104305208_04008 SAMEA104305242_04084 SAMEA104305271_04290 SAMEA104305318_04148 SAMEA104305325_04185 SAMEA104305343_03919 SAMEA104305385_00775 ari-1 blaOXA bla_1 bla_3 oxa23
Type:
PROTEIN
Mol. Mass.:
30981.53
Organism:
Acinetobacter baumannii
Description:
ChEMBL_117207
Residue:
273
  
Inhibitor
Name:
BDBM50089084
Synonyms:
CHEMBL3317857 | Vaborbactam
Type:
Small organic molecule
Emp. Form.:
C12H16BNO5S
Mol. Mass.:
297.135
SMILES:
OB1O[C@H](CC(O)=O)CC[C@@H]1NC(=O)Cc1cccs1
: