Target
Microsomal triglyceride transfer protein large subunit
Ligand
BDBM50098326
Substrate
Meas. Tech.
ChEMBL_103132 (CHEMBL712302)
IC50
4±n/a nM
Citation
 Robl, JASulsky, RSun, CQSimpkins, LMWang, TDickson, JKChen, YMagnin, DRTaunk, PSlusarchyk, WABiller, SALan, SJConnolly, FKunselman, LKSabrah, TJamil, HGordon, DHarrity, TWWetterau, JR A novel series of highly potent benzimidazole-based microsomal triglyceride transfer protein inhibitors. J Med Chem 44:851-6 (2001)  
Target
Name:
Microsomal triglyceride transfer protein large subunit
Synonyms:
MTP MTTP Microsomal triglyceride transfer protein large subunit
Type:
PROTEIN
Mol. Mass.:
99365.65
Organism:
Homo sapiens (Human)
Description:
ChEMBL_971724
Residue:
894
  
Inhibitor
Name:
BDBM50098326
Synonyms:
9-(4-{2-Isopropyl-4-[(4'-trifluoromethyl-biphenyl-2-carbonyl)-amino]-benzoimidazol-1-yl}-butyl)-9H-fluorene-9-carboxylic acid (2,2,2-trifluoro-ethyl)-amide | CHEMBL168680
Type:
Small organic molecule
Emp. Form.:
C44H38F6N4O2
Mol. Mass.:
768.7885
SMILES:
CC(C)c1nc2c(NC(=O)c3ccccc3-c3ccc(cc3)C(F)(F)F)cccc2n1CCCCC1(C(=O)NCC(F)(F)F)c2ccccc2-c2ccccc12
: