Target
Beta-3 adrenergic receptor
Ligand
BDBM50099149
Substrate
Meas. Tech.
ChEBML_218126
EC50
75.0±n/a nM
Citation
 Hu, BMalamas, MEllingboe, JLargis, EHan, SMulvey, RTillett, J New oxadiazolidinedione derivatives as potent and selective human beta3 agonists. Bioorg Med Chem Lett 11:981-4 (2001)  
Target
Name:
Beta-3 adrenergic receptor
Synonyms:
ADRB3 ADRB3_HUMAN Beta-2 adrenergic receptor and beta-3 adrenergic receptor Beta-3 adrenoreceptor | adrenergic Beta3
Type:
G Protein-Coupled Receptor (GPCR)
Mol. Mass.:
43534.88
Organism:
Homo sapiens (Human)
Description:
Residue:
408
  
Inhibitor
Name:
BDBM50099149
Synonyms:
5-{4-[4-((S)-2-Hydroxy-3-phenoxy-propylamino)-piperidin-1-yl]-benzylidene}-2-piperidin-1-yl-thiazol-4-one | CHEMBL171963
Type:
Small organic molecule
Emp. Form.:
C29H36N4O3S
Mol. Mass.:
520.686
SMILES:
O[C@@H](CNC1CCN(CC1)c1ccc(\C=C2/SC(=NC2=O)N2CCCCC2)cc1)COc1ccccc1
: