Target
Beta-3 adrenergic receptor
Ligand
BDBM50099151
Substrate
Meas. Tech.
ChEBML_218126
EC50
10±n/a nM
Citation
 Hu, BMalamas, MEllingboe, JLargis, EHan, SMulvey, RTillett, J New oxadiazolidinedione derivatives as potent and selective human beta3 agonists. Bioorg Med Chem Lett 11:981-4 (2001)  
Target
Name:
Beta-3 adrenergic receptor
Synonyms:
ADRB3 ADRB3_HUMAN Beta-2 adrenergic receptor and beta-3 adrenergic receptor Beta-3 adrenoreceptor | adrenergic Beta3
Type:
G Protein-Coupled Receptor (GPCR)
Mol. Mass.:
43534.88
Organism:
Homo sapiens (Human)
Description:
Residue:
408
  
Inhibitor
Name:
BDBM50099151
Synonyms:
CHEMBL177442 | N'-[5-(4-{4-[(S)-2-Hydroxy-3-(2-oxo-2,3-dihydro-1H-benzoimidazol-4-yloxy)-propylamino]-piperidin-1-yl}-benzylidene)-4-oxo-4,5-dihydro-thiazol-2-yl]-N,N-dimethyl-guanidine
Type:
Small organic molecule
Emp. Form.:
C28H34N8O4S
Mol. Mass.:
578.686
SMILES:
CN(C)C(=N)NC1=NC(=O)C(S1)=Cc1ccc(cc1)N1CCC(CC1)NC[C@H](O)COc1cccc2[nH]c(=O)[nH]c12
: