Target
Beta-3 adrenergic receptor
Ligand
BDBM50099152
Substrate
Meas. Tech.
ChEBML_218126
EC50
90±n/a nM
Citation
 Hu, BMalamas, MEllingboe, JLargis, EHan, SMulvey, RTillett, J New oxadiazolidinedione derivatives as potent and selective human beta3 agonists. Bioorg Med Chem Lett 11:981-4 (2001)  
Target
Name:
Beta-3 adrenergic receptor
Synonyms:
ADRB3 ADRB3_HUMAN Beta-2 adrenergic receptor and beta-3 adrenergic receptor Beta-3 adrenoreceptor | adrenergic Beta3
Type:
G Protein-Coupled Receptor (GPCR)
Mol. Mass.:
43534.88
Organism:
Homo sapiens (Human)
Description:
Residue:
408
  
Inhibitor
Name:
BDBM50099152
Synonyms:
CHEMBL366395 | N-{5-[(R)-2-(1-{4-[2-(1-Benzyl-piperidin-4-ylamino)-4-oxo-4H-thiazol-5-ylidenemethyl]-phenyl}-piperidin-4-ylamino)-1-hydroxy-ethyl]-2-hydroxy-phenyl}-methanesulfonamide
Type:
Small organic molecule
Emp. Form.:
C36H44N6O5S2
Mol. Mass.:
704.902
SMILES:
CS(=O)(=O)Nc1cc(ccc1O)[C@@H](O)CNC1CCN(CC1)c1ccc(C=C2SC(NC3CCN(Cc4ccccc4)CC3)=NC2=O)cc1
: