Target
Beta-3 adrenergic receptor
Ligand
BDBM50099155
Substrate
Meas. Tech.
ChEBML_218126
EC50
34±n/a nM
Citation
 Hu, BMalamas, MEllingboe, JLargis, EHan, SMulvey, RTillett, J New oxadiazolidinedione derivatives as potent and selective human beta3 agonists. Bioorg Med Chem Lett 11:981-4 (2001)  
Target
Name:
Beta-3 adrenergic receptor
Synonyms:
ADRB3 ADRB3_HUMAN Beta-2 adrenergic receptor and beta-3 adrenergic receptor Beta-3 adrenoreceptor | adrenergic Beta3
Type:
G Protein-Coupled Receptor (GPCR)
Mol. Mass.:
43534.88
Organism:
Homo sapiens (Human)
Description:
Residue:
408
  
Inhibitor
Name:
BDBM50099155
Synonyms:
CHEMBL174054 | N-[2-Hydroxy-5-(1-hydroxy-2-{1-[4-(2-imino-5-oxo-imidazolidin-4-ylidenemethyl)-phenyl]-piperidin-4-ylamino}-ethyl)-phenyl]-methanesulfonamide
Type:
Small organic molecule
Emp. Form.:
C24H30N6O5S
Mol. Mass.:
514.597
SMILES:
CS(=O)(=O)Nc1cc(ccc1O)C(O)CNC1CCN(CC1)c1ccc(C=C2N=C(N)NC2=O)cc1
: