Target
Beta-3 adrenergic receptor
Ligand
BDBM50099156
Substrate
Meas. Tech.
ChEBML_218126
EC50
940.0±n/a nM
Citation
 Hu, BMalamas, MEllingboe, JLargis, EHan, SMulvey, RTillett, J New oxadiazolidinedione derivatives as potent and selective human beta3 agonists. Bioorg Med Chem Lett 11:981-4 (2001)  
Target
Name:
Beta-3 adrenergic receptor
Synonyms:
ADRB3 ADRB3_HUMAN Beta-2 adrenergic receptor and beta-3 adrenergic receptor Beta-3 adrenoreceptor | adrenergic Beta3
Type:
G Protein-Coupled Receptor (GPCR)
Mol. Mass.:
43534.88
Organism:
Homo sapiens (Human)
Description:
Residue:
408
  
Inhibitor
Name:
BDBM50099156
Synonyms:
CHEMBL174534 | N'-(5-{4-[4-((S)-2-Hydroxy-3-phenoxy-propylamino)-piperidin-1-yl]-benzylidene}-4-oxo-4,5-dihydro-thiazol-2-yl)-N,N-dimethyl-guanidine
Type:
Small organic molecule
Emp. Form.:
C27H34N6O3S
Mol. Mass.:
522.662
SMILES:
CN(C)C(=N)NC1=NC(=O)C(S1)=Cc1ccc(cc1)N1CCC(CC1)NC[C@H](O)COc1ccccc1
: