Target
Beta-1 adrenergic receptor
Ligand
BDBM50099150
Substrate
Meas. Tech.
ChEMBL_38133 (CHEMBL650088)
Ki
9490±n/a nM
Citation
 Hu, BMalamas, MEllingboe, JLargis, EHan, SMulvey, RTillett, J New oxadiazolidinedione derivatives as potent and selective human beta3 agonists. Bioorg Med Chem Lett 11:981-4 (2001)  
Target
Name:
Beta-1 adrenergic receptor
Synonyms:
ADRB1 ADRB1_HUMAN Beta-1 adrenoceptor adrenergic Beta1
Type:
G Protein-Coupled Receptor (GPCR)
Mol. Mass.:
51338.40
Organism:
Homo sapiens (Human)
Description:
P08588
Residue:
477
  
Inhibitor
Name:
BDBM50099150
Synonyms:
CHEMBL368584 | N-[5-(2-{1-[4-((R)-3,5-Dioxo-[1,2,4]oxadiazolidin-2-ylmethyl)-phenyl]-piperidin-4-ylamino}-1-hydroxy-ethyl)-2-hydroxy-phenyl]-methanesulfonamide
Type:
Small organic molecule
Emp. Form.:
C23H29N5O7S
Mol. Mass.:
519.571
SMILES:
CS(=O)(=O)Nc1cc(ccc1O)[C@@H](O)CNC1CCN(CC1)c1ccc(Cn2oc(=O)[nH]c2=O)cc1
: