Target
Beta-3 adrenergic receptor
Ligand
BDBM50099157
Substrate
Meas. Tech.
ChEBML_218126
EC50
1±n/a nM
Citation
 Hu, BMalamas, MEllingboe, JLargis, EHan, SMulvey, RTillett, J New oxadiazolidinedione derivatives as potent and selective human beta3 agonists. Bioorg Med Chem Lett 11:981-4 (2001)  
Target
Name:
Beta-3 adrenergic receptor
Synonyms:
ADRB3 ADRB3_HUMAN Beta-2 adrenergic receptor and beta-3 adrenergic receptor Beta-3 adrenoreceptor | adrenergic Beta3
Type:
G Protein-Coupled Receptor (GPCR)
Mol. Mass.:
43534.88
Organism:
Homo sapiens (Human)
Description:
Residue:
408
  
Inhibitor
Name:
BDBM50099157
Synonyms:
CHEMBL435307 | N-[2-Hydroxy-5-((S)-2-hydroxy-3-{1-[4-(4-oxo-2-piperidin-1-yl-4H-thiazol-5-ylidenemethyl)-phenyl]-piperidin-4-ylamino}-propoxy)-phenyl]-methanesulfonamide
Type:
Small organic molecule
Emp. Form.:
C30H39N5O6S2
Mol. Mass.:
629.791
SMILES:
CS(=O)(=O)Nc1cc(OC[C@@H](O)CNC2CCN(CC2)c2ccc(\C=C3/SC(=NC3=O)N3CCCCC3)cc2)ccc1O
: