Target
Beta-3 adrenergic receptor
Ligand
BDBM50099159
Substrate
Meas. Tech.
ChEBML_218126
EC50
9.0±n/a nM
Citation
 Hu, BMalamas, MEllingboe, JLargis, EHan, SMulvey, RTillett, J New oxadiazolidinedione derivatives as potent and selective human beta3 agonists. Bioorg Med Chem Lett 11:981-4 (2001)  
Target
Name:
Beta-3 adrenergic receptor
Synonyms:
ADRB3 ADRB3_HUMAN Beta-2 adrenergic receptor and beta-3 adrenergic receptor Beta-3 adrenoreceptor | adrenergic Beta3
Type:
G Protein-Coupled Receptor (GPCR)
Mol. Mass.:
43534.88
Organism:
Homo sapiens (Human)
Description:
Residue:
408
  
Inhibitor
Name:
BDBM50099159
Synonyms:
CHEMBL174442 | N-[2-Hydroxy-5-((R)-1-hydroxy-2-{1-[4-(4-oxo-2-piperidin-1-yl-4H-thiazol-5-ylidenemethyl)-phenyl]-piperidin-4-ylamino}-ethyl)-phenyl]-methanesulfonamide
Type:
Small organic molecule
Emp. Form.:
C29H37N5O5S2
Mol. Mass.:
599.765
SMILES:
CS(=O)(=O)Nc1cc(ccc1O)[C@@H](O)CNC1CCN(CC1)c1ccc(\C=C2/SC(=NC2=O)N2CCCCC2)cc1
: