Target
Beta-3 adrenergic receptor
Ligand
BDBM50099165
Substrate
Meas. Tech.
ChEBML_218126
EC50
6±n/a nM
Citation
 Hu, BMalamas, MEllingboe, JLargis, EHan, SMulvey, RTillett, J New oxadiazolidinedione derivatives as potent and selective human beta3 agonists. Bioorg Med Chem Lett 11:981-4 (2001)  
Target
Name:
Beta-3 adrenergic receptor
Synonyms:
ADRB3 ADRB3_HUMAN Beta-2 adrenergic receptor and beta-3 adrenergic receptor Beta-3 adrenoreceptor | adrenergic Beta3
Type:
G Protein-Coupled Receptor (GPCR)
Mol. Mass.:
43534.88
Organism:
Homo sapiens (Human)
Description:
Residue:
408
  
Inhibitor
Name:
BDBM50099165
Synonyms:
8-Hydroxy-5-((S)-2-hydroxy-3-{1-[4-(4-oxo-2-piperidin-1-yl-4H-thiazol-5-ylidenemethyl)-phenyl]-piperidin-4-ylamino}-propoxy)-3,4-dihydro-1H-quinolin-2-one | CHEMBL368392
Type:
Small organic molecule
Emp. Form.:
C32H39N5O5S
Mol. Mass.:
605.748
SMILES:
O[C@@H](CNC1CCN(CC1)c1ccc(\C=C2/SC(=NC2=O)N2CCCCC2)cc1)COc1ccc(O)c2NC(=O)CCc12
: