Target
Beta-3 adrenergic receptor
Ligand
BDBM50099168
Substrate
Meas. Tech.
ChEBML_218126
EC50
3±n/a nM
Citation
 Hu, BMalamas, MEllingboe, JLargis, EHan, SMulvey, RTillett, J New oxadiazolidinedione derivatives as potent and selective human beta3 agonists. Bioorg Med Chem Lett 11:981-4 (2001)  
Target
Name:
Beta-3 adrenergic receptor
Synonyms:
ADRB3 ADRB3_HUMAN Beta-2 adrenergic receptor and beta-3 adrenergic receptor Beta-3 adrenoreceptor | adrenergic Beta3
Type:
G Protein-Coupled Receptor (GPCR)
Mol. Mass.:
43534.88
Organism:
Homo sapiens (Human)
Description:
Residue:
408
  
Inhibitor
Name:
BDBM50099168
Synonyms:
CHEMBL177400 | N-{5-[(R)-2-(1-{4-[2-(N',N'-Dimethyl-guanidino)-4-oxo-4H-thiazol-5-ylidenemethyl]-phenyl}-piperidin-4-ylamino)-1-hydroxy-ethyl]-2-hydroxy-phenyl}-methanesulfonamide
Type:
Small organic molecule
Emp. Form.:
C27H35N7O5S2
Mol. Mass.:
601.741
SMILES:
CN(C)C(=N)NC1=NC(=O)C(S1)=Cc1ccc(cc1)N1CCC(CC1)NC[C@H](O)c1ccc(O)c(NS(C)(=O)=O)c1
: