Target
Beta-3 adrenergic receptor
Ligand
BDBM50099166
Substrate
Meas. Tech.
ChEBML_218126
EC50
2±n/a nM
Citation
 Hu, BMalamas, MEllingboe, JLargis, EHan, SMulvey, RTillett, J New oxadiazolidinedione derivatives as potent and selective human beta3 agonists. Bioorg Med Chem Lett 11:981-4 (2001)  
Target
Name:
Beta-3 adrenergic receptor
Synonyms:
ADRB3 ADRB3_HUMAN Beta-2 adrenergic receptor and beta-3 adrenergic receptor Beta-3 adrenoreceptor | adrenergic Beta3
Type:
G Protein-Coupled Receptor (GPCR)
Mol. Mass.:
43534.88
Organism:
Homo sapiens (Human)
Description:
Residue:
408
  
Inhibitor
Name:
BDBM50099166
Synonyms:
CHEMBL367561 | N'-[5-(4-{4-[(S)-2-Hydroxy-3-(8-hydroxy-2-oxo-1,2,3,4-tetrahydro-quinolin-5-yloxy)-propylamino]-piperidin-1-yl}-benzylidene)-4-oxo-4,5-dihydro-thiazol-2-yl]-N,N-dimethyl-guanidine
Type:
Small organic molecule
Emp. Form.:
C30H37N7O5S
Mol. Mass.:
607.724
SMILES:
CN(C)C(=N)NC1=NC(=O)C(S1)=Cc1ccc(cc1)N1CCC(CC1)NC[C@H](O)COc1ccc(O)c2NC(=O)CCc12
: