Target
DNA topoisomerase 1
Ligand
BDBM50008935
Substrate
Meas. Tech.
ChEMBL_208433 (CHEMBL814847)
IC50
20000±n/a nM
Citation
 Kim, DKRyu, DHLee, JYLee, NKim, YWKim, JSChang, KIm, GJKim, TKChoi, WS Synthesis and biological evaluation of novel A-ring modified hexacyclic camptothecin analogues. J Med Chem 44:1594-602 (2001)  
Target
Name:
DNA topoisomerase 1
Synonyms:
DNA topoisomerase I Top-1 | Top1
Type:
PROTEIN
Mol. Mass.:
90922.04
Organism:
Mus musculus
Description:
ChEMBL_208411
Residue:
767
  
Inhibitor
Name:
BDBM50008935
Synonyms:
(20S)-10-Dimethylaminomethyl-4-ethyl-4,9-dihydroxy-1,12-dihydro-4H-2-oxa-6,12a-diaza-dibenzo[b,h]fluorene-3,13-dione (S)-10-[(DIMETHYLAMINO)METHYL]-4-ETHYL-4,9-DIHYDROXY-1H-PYRANO[3'',4'':6,7]INOLIZINO[1,2-B]-QUINOLINE-3,14(4H,12H)-DIONE (S)-11-Dimethylaminomethyl-4-ethyl-4,9-dihydroxy-1,12-dihydro-4H-2-oxa-6,12a-diaza-dibenzo[b,h]fluorene-3,13-dione 10-Dimethylaminomethyl-4-ethyl-4,9-dihydroxy-1,12-dihydro-4H-2-oxa-6,12a-diaza-dibenzo[b,h]fluorene-3,13-dione (Topotecan) 10-dimethylaminomethyl-4-ethyl-4,9-dihydroxy-(4S)-3,4,12,14-tetrahydro-1H-pyrano[3'',4'':6,7]indolizino[1,2-b]quinoline-3,14-dione Hycamtin TOPOTECAN HYDROCHLORIDE | cid_60700
Type:
Small organic molecule
Emp. Form.:
C23H23N3O5
Mol. Mass.:
421.4458
SMILES:
CC[C@@]1(O)C(=O)OCc2c1cc1-c3nc4ccc(O)c(CN(C)C)c4cc3Cn1c2=O
: