Target
DNA topoisomerase 1
Ligand
BDBM50099246
Substrate
Meas. Tech.
ChEMBL_208433 (CHEMBL814847)
IC50
21000±n/a nM
Citation
 Kim, DKRyu, DHLee, JYLee, NKim, YWKim, JSChang, KIm, GJKim, TKChoi, WS Synthesis and biological evaluation of novel A-ring modified hexacyclic camptothecin analogues. J Med Chem 44:1594-602 (2001)  
Target
Name:
DNA topoisomerase 1
Synonyms:
DNA topoisomerase I Top-1 | Top1
Type:
PROTEIN
Mol. Mass.:
90922.04
Organism:
Mus musculus
Description:
ChEMBL_208411
Residue:
767
  
Inhibitor
Name:
BDBM50099246
Synonyms:
9-ethyl-9-hydroxy-1-methyl-(9S)-2,3,9,10,13,15-hexahydro-1H,12H-[1,4]oxazino[3,2-f]pyrano[3',4':6,7]indolizino[1,2-b]quinoline-10,13-dione | CHEMBL297811
Type:
Small organic molecule
Emp. Form.:
C23H21N3O5
Mol. Mass.:
419.4299
SMILES:
CC[C@@]1(O)C(=O)OCc2c1cc1-c3nc4ccc5OCCN(C)c5c4cc3Cn1c2=O
: