Target
5-hydroxytryptamine receptor 2A
Ligand
BDBM50099270
Substrate
Meas. Tech.
ChEMBL_2277 (CHEMBL617063)
Ki
0.69±n/a nM
Citation
 Rowley, MHallett, DJGoodacre, SMoyes, CCrawforth, JSparey, TJPatel, SMarwood, RPatel, SThomas, SHitzel, LO'Connor, DSzeto, NCastro, JLHutson, PHMacLeod, AM 3-(4-Fluoropiperidin-3-yl)-2-phenylindoles as high affinity, selective, and orally bioavailable h5-HT(2A) receptor antagonists. J Med Chem 44:1603-14 (2001)  
Target
Name:
5-hydroxytryptamine receptor 2A
Synonyms:
5-HT-2 5-HT2A 5-hydroxytryptamine receptor 2A (5HT-2A) 5HT2A_HUMAN HTR2A | Serotonin receptor 2A
Type:
undefined
Mol. Mass.:
52607.65
Organism:
Homo sapiens (Human)
Description:
P28223
Residue:
471
  
Inhibitor
Name:
BDBM50099270
Synonyms:
7-Chloro-3-(4-fluoro-piperidin-3-yl)-2-phenyl-1H-indole | CHEMBL42784
Type:
Small organic molecule
Emp. Form.:
C19H18ClFN2
Mol. Mass.:
328.811
SMILES:
F[C@@H]1CCNCC1c1c([nH]c2c(Cl)cccc12)-c1ccccc1
: