Target
D(2) dopamine receptor
Ligand
BDBM50099279
Substrate
Meas. Tech.
ChEMBL_60052 (CHEMBL671367)
Ki
>1700±n/a nM
Citation
 Rowley, MHallett, DJGoodacre, SMoyes, CCrawforth, JSparey, TJPatel, SMarwood, RPatel, SThomas, SHitzel, LO'Connor, DSzeto, NCastro, JLHutson, PHMacLeod, AM 3-(4-Fluoropiperidin-3-yl)-2-phenylindoles as high affinity, selective, and orally bioavailable h5-HT(2A) receptor antagonists. J Med Chem 44:1603-14 (2001)  
Target
Name:
D(2) dopamine receptor
Synonyms:
D(2) dopamine receptor DOPAMINE D2 Long DRD2 Dopamine D2 receptor Dopamine D2 receptor (D2R) Dopamine2-like | d2
Type:
Cell-surface receptors
Mol. Mass.:
50647.10
Organism:
Homo sapiens (Human)
Description:
P14416
Residue:
443
  
Inhibitor
Name:
BDBM50099279
Synonyms:
3-(4-Fluoro-piperidin-3-yl)-2-phenyl-1H-indole | CHEMBL41860
Type:
Small organic molecule
Emp. Form.:
C19H19FN2
Mol. Mass.:
294.366
SMILES:
F[C@H]1CCNCC1c1c([nH]c2ccccc12)-c1ccccc1
: