Target
Potassium voltage-gated channel subfamily H member 2
Ligand
BDBM50095049
Substrate
Meas. Tech.
ChEMBL_158556 (CHEMBL768699)
Ki
80±n/a nM
Citation
 Rowley, MHallett, DJGoodacre, SMoyes, CCrawforth, JSparey, TJPatel, SMarwood, RPatel, SThomas, SHitzel, LO'Connor, DSzeto, NCastro, JLHutson, PHMacLeod, AM 3-(4-Fluoropiperidin-3-yl)-2-phenylindoles as high affinity, selective, and orally bioavailable h5-HT(2A) receptor antagonists. J Med Chem 44:1603-14 (2001)  
Target
Name:
Potassium voltage-gated channel subfamily H member 2
Synonyms:
1,3-beta-glucan synthase component GLS2 ERG Eag-related protein 1 Ether-a-go-go-related gene (HERG) Ether-a-go-go-related gene potassium channel 1 Ether-a-go-go-related gene potassium channel 1 (hERG1) Ether-a-go-go-related protein 1 H-ERG KCNH2 Potassium voltage-gated channel subfamily H member 2 (hERG) Voltage-gated potassium channel subunit Kv11.1 hERG Potassium Channel 1 | putative potassium channel subunit
Type:
Multi-pass membrane protein
Mol. Mass.:
126672.65
Organism:
Homo sapiens (Human)
Description:
Q12809
Residue:
1159
  
Inhibitor
Name:
BDBM50095049
Synonyms:
3-(1-Phenethyl-piperidin-4-yl)-2-phenyl-1H-indole CHEMBL40584
Type:
Small organic molecule
Emp. Form.:
C27H28N2
Mol. Mass.:
380.5246
SMILES:
C(Cc1ccccc1)N1CCC(CC1)c1c([nH]c2ccccc12)-c1ccccc1
: