Target
5-hydroxytryptamine receptor 2C
Ligand
BDBM50099255
Substrate
Meas. Tech.
ChEMBL_2955 (CHEMBL617895)
Ki
16±n/a nM
Citation
 Rowley, MHallett, DJGoodacre, SMoyes, CCrawforth, JSparey, TJPatel, SMarwood, RPatel, SThomas, SHitzel, LO'Connor, DSzeto, NCastro, JLHutson, PHMacLeod, AM 3-(4-Fluoropiperidin-3-yl)-2-phenylindoles as high affinity, selective, and orally bioavailable h5-HT(2A) receptor antagonists. J Med Chem 44:1603-14 (2001)  
Target
Name:
5-hydroxytryptamine receptor 2C
Synonyms:
5-HT-1C 5-HT1C 5-HT2C-INI 5-HTR2C 5-hydroxytryptamine receptor 2C (5-HT-2C) 5HT-1C HTR1C Serotonin (5-HT3) receptor Serotonin Receptor 2C
Type:
G Protein-Coupled Receptor (GPCR)
Mol. Mass.:
51836.79
Organism:
Homo sapiens (Human)
Description:
P28335
Residue:
458
  
Inhibitor
Name:
BDBM50099255
Synonyms:
6-Fluoro-2-(4-fluoro-phenyl)-3-piperidin-3-yl-1H-indole CHEMBL296512
Type:
Small organic molecule
Emp. Form.:
C19H18F2N2
Mol. Mass.:
312.3564
SMILES:
Fc1ccc(cc1)-c1[nH]c2cc(F)ccc2c1C1CCCNC1
: