Target
5-hydroxytryptamine receptor 2C
Ligand
BDBM50099276
Substrate
Meas. Tech.
ChEMBL_2955 (CHEMBL617895)
Ki
85±n/a nM
Citation
 Rowley, MHallett, DJGoodacre, SMoyes, CCrawforth, JSparey, TJPatel, SMarwood, RPatel, SThomas, SHitzel, LO'Connor, DSzeto, NCastro, JLHutson, PHMacLeod, AM 3-(4-Fluoropiperidin-3-yl)-2-phenylindoles as high affinity, selective, and orally bioavailable h5-HT(2A) receptor antagonists. J Med Chem 44:1603-14 (2001)  
Target
Name:
5-hydroxytryptamine receptor 2C
Synonyms:
5-HT-1C 5-HT1C 5-HT2C-INI 5-HTR2C 5-hydroxytryptamine receptor 2C (5-HT-2C) 5HT-1C HTR1C Serotonin (5-HT3) receptor Serotonin Receptor 2C
Type:
G Protein-Coupled Receptor (GPCR)
Mol. Mass.:
51836.79
Organism:
Homo sapiens (Human)
Description:
P28335
Residue:
458
  
Inhibitor
Name:
BDBM50099276
Synonyms:
6-Fluoro-3-(4-fluoro-piperidin-3-yl)-2-pyridin-3-yl-1H-indole | CHEMBL41479
Type:
Small organic molecule
Emp. Form.:
C18H17F2N3
Mol. Mass.:
313.3445
SMILES:
F[C@@H]1CCNCC1c1c([nH]c2cc(F)ccc12)-c1cccnc1
: