Target
Dual specificity protein kinase TTK
Ligand
BDBM236660
Substrate
Meas. Tech.
ChEMBL_1987223 (CHEMBL4620770)
IC50
1160±n/a nM
Citation
 Schulze, VKKlar, UKosemund, DWengner, AMSiemeister, GStöckigt, DNeuhaus, RLienau, PBader, BPrechtl, SHolton, SJBriem, HMarquardt, TSchirok, HJautelat, RBohlmann, RNguyen, DFernández-Montalván, AEBömer, UEberspaecher, UBrüning, MDöhr, ORaschke, MKreft, BMumberg, DZiegelbauer, KBrands, Mvon Nussbaum, FKoppitz, M Treating Cancer by Spindle Assembly Checkpoint Abrogation: Discovery of Two Clinical Candidates, BAY 1161909 and BAY 1217389, Targeting MPS1 Kinase. J Med Chem 63:8025-8042 (2020)  
Target
Name:
Dual specificity protein kinase TTK
Synonyms:
Dual specificity protein kinase (TTK) MPS1 Monopolar Spindle 1 (MPS1) Monopolar Spindle 1 Kinase (MPS1) TTK | TTK_HUMAN
Type:
Protein
Mol. Mass.:
97086.79
Organism:
Homo sapiens (Human)
Description:
P33981
Residue:
857
  
Inhibitor
Name:
BDBM236660
Synonyms:
US9388140, 1
Type:
Small organic molecule
Emp. Form.:
C21H24N4O
Mol. Mass.:
348.4415
SMILES:
CC(C)CNc1cccc2n(cnc12)-c1ccc(cc1)C(=O)NC1CC1
: