Target
D(2) dopamine receptor
Ligand
BDBM50099800
Substrate
Meas. Tech.
ChEMBL_62231 (CHEMBL675742)
Ki
5.8±n/a nM
Citation
 Huang, YLuedtke, RRFreeman, RAWu, LMach, RH Synthesis and structure-activity relationships of naphthamides as dopamine D3 receptor ligands. J Med Chem 44:1815-26 (2001)  
Target
Name:
D(2) dopamine receptor
Synonyms:
DOPAMINE D2 DOPAMINE D2 Short Dopamine D2 receptor Drd2
Type:
G Protein-Coupled Receptor (GPCR)
Mol. Mass.:
50931.60
Organism:
Rattus norvegicus (rat)
Description:
P61169
Residue:
444
  
Inhibitor
Name:
BDBM50099800
Synonyms:
4-Bromo-1-methoxy-naphthalene-2-carboxylic acid (1-adamantan-2-yl-pyrrolidin-3-yl)-amide | CHEMBL52298
Type:
Small organic molecule
Emp. Form.:
C26H31BrN2O2
Mol. Mass.:
483.441
SMILES:
COc1c(cc(Br)c2ccccc12)C(=O)N[C@H]1CCN(C1)C1[C@H]2C[C@@H]3C[C@@H](C[C@H]1C3)C2
: