Target
Retinoic acid receptor gamma
Ligand
BDBM50092055
Substrate
Meas. Tech.
ChEBML_196329
Ki
>400±n/a nM
Citation
 Weiss, KLAlshafie, GChapman, JSMershon, SMAbou-Issa, HClagett-Dame, MCurley, RW An unhydrolyzable analogue of N-(4-hydroxyphenyl)retinamide. synthesis and preliminary biological studies. Bioorg Med Chem Lett 11:1583-6 (2001)  
Target
Name:
Retinoic acid receptor gamma
Synonyms:
NR1B3 RAR-gamma RARG_HUMAN Retinoic acid receptor gamma | Retinoid receptor
Type:
PROTEIN
Mol. Mass.:
50345.43
Organism:
Homo sapiens (Human)
Description:
ChEMBL_1458016
Residue:
454
  
Inhibitor
Name:
BDBM50092055
Synonyms:
(2E,4E,6E,8E)-3,7-Dimethyl-9-(2,6,6-trimethyl-cyclohex-1-enyl)-nona-2,4,6,8-tetraenoic acid (4-hydroxy-phenyl)-amide 3,7-Dimethyl-9-(2,6,6-trimethyl-cyclohex-1-enyl)-nona-2,4,6,8-tetraenoic acid (4-hydroxy-phenyl)-amide CHEMBL7301 N-(4-HYDROXYPHENYL)ALL-TRANS RETINAMIDE N-(4-hydroxyphenyl)retinamide | N-(4-hydroxyphenyl)retinamide, 4-HPR
Type:
Small organic molecule
Emp. Form.:
C26H33NO2
Mol. Mass.:
391.5457
SMILES:
C\C(\C=C\C1=C(C)CCCC1(C)C)=C/C=C/C(/C)=C/C(=O)Nc1ccc(O)cc1
: