Target
Thymidine kinase
Ligand
BDBM50101065
Substrate
Meas. Tech.
ChEBML_210614
IC50
8.4±n/a nM
Citation
 Martin, JALambert, RWMerrett, JHParkes, KEThomas, GJBaker, SJBushnell, DJCansfield, JEDunsdon, SJFreeman, ACHopkins, RAJohns, IRKeech, ESimmonite, HWalmsley, AWong Kai-In, PHolland, M Nucleoside analogues as highly potent and selective inhibitors of herpes simplex virus thymidine kinase. Bioorg Med Chem Lett 11:1655-8 (2001)  
Target
Name:
Thymidine kinase
Synonyms:
Type:
PROTEIN
Mol. Mass.:
40396.73
Organism:
Human herpesvirus 2
Description:
ChEMBL_474155
Residue:
376
  
Inhibitor
Name:
BDBM50101065
Synonyms:
2-(2,6-Dimethyl-phenyl)-N-[(2R,3S,5R)-5-(5-ethyl-2,4-dioxo-3,4-dihydro-2H-pyrimidin-1-yl)-3-hydroxy-tetrahydro-furan-2-ylmethyl]-acetamide | CHEMBL415909
Type:
Small organic molecule
Emp. Form.:
C21H27N3O5
Mol. Mass.:
401.4562
SMILES:
CCc1cn([C@H]2C[C@H](O)[C@@H](CNC(=O)Cc3c(C)cccc3C)O2)c(=O)[nH]c1=O
: