Target
Thymidine kinase
Ligand
BDBM50101067
Substrate
Meas. Tech.
ChEBML_210614
IC50
0.190000±n/a nM
Citation
 Martin, JALambert, RWMerrett, JHParkes, KEThomas, GJBaker, SJBushnell, DJCansfield, JEDunsdon, SJFreeman, ACHopkins, RAJohns, IRKeech, ESimmonite, HWalmsley, AWong Kai-In, PHolland, M Nucleoside analogues as highly potent and selective inhibitors of herpes simplex virus thymidine kinase. Bioorg Med Chem Lett 11:1655-8 (2001)  
Target
Name:
Thymidine kinase
Synonyms:
Type:
PROTEIN
Mol. Mass.:
40396.73
Organism:
Human herpesvirus 2
Description:
ChEMBL_474155
Residue:
376
  
Inhibitor
Name:
BDBM50101067
Synonyms:
(S)-2-(2,4-Dichloro-5-methoxy-phenoxy)-N-[(2R,3R,4S,5R)-5-(5-ethyl-2,4-dioxo-3,4-dihydro-2H-pyrimidin-1-yl)-4-fluoro-3-hydroxy-tetrahydro-furan-2-ylmethyl]-propionamide | CHEMBL42820
Type:
Small organic molecule
Emp. Form.:
C21H24Cl2FN3O7
Mol. Mass.:
520.336
SMILES:
CCc1cn([C@@H]2O[C@H](CNC(=O)[C@H](C)Oc3cc(OC)c(Cl)cc3Cl)[C@@H](O)[C@@H]2F)c(=O)[nH]c1=O
: