Target
Substance-P receptor
Ligand
BDBM50101419
Substrate
Meas. Tech.
ChEMBL_205730 (CHEMBL809497)
IC50
0.96±n/a nM
Citation
 Ashwood, VAField, MJHorwell, DCJulien-Larose, CLewthwaite, RAMcCleary, SPritchard, MCRaphy, JSingh, L Utilization of an intramolecular hydrogen bond to increase the CNS penetration of an NK(1) receptor antagonist. J Med Chem 44:2276-85 (2001)  
Target
Name:
Substance-P receptor
Synonyms:
NK-1 receptor NK1 Receptor NK1R_HUMAN Neurokinin-1 (NK-1) SPR TACR1 Tachykinin receptor 1 (NK1) | tachykinin
Type:
G Protein-Coupled Receptor (GPCR)
Mol. Mass.:
46254.43
Organism:
Homo sapiens (Human)
Description:
P25103
Residue:
407
  
Inhibitor
Name:
BDBM50101419
Synonyms:
CHEMBL77684 | [1-(1H-Indol-3-ylmethyl)-1-(1-phenyl-ethylcarbamoyl)-propyl]-carbamic acid benzofuran-2-ylmethyl ester
Type:
Small organic molecule
Emp. Form.:
C31H31N3O4
Mol. Mass.:
509.5955
SMILES:
CC[C@](Cc1c[nH]c2ccccc12)(NC(=O)OCc1cc2ccccc2o1)C(=O)N[C@@H](C)c1ccccc1
: