Target
Substance-P receptor
Ligand
BDBM50101416
Substrate
Meas. Tech.
ChEMBL_205394 (CHEMBL817411)
IC50
5.9±n/a nM
Citation
 Ashwood, VAField, MJHorwell, DCJulien-Larose, CLewthwaite, RAMcCleary, SPritchard, MCRaphy, JSingh, L Utilization of an intramolecular hydrogen bond to increase the CNS penetration of an NK(1) receptor antagonist. J Med Chem 44:2276-85 (2001)  
Target
Name:
Substance-P receptor
Synonyms:
NK-1 receptor NK1 Receptor NK1R_HUMAN Neurokinin-1 (NK-1) SPR TACR1 Tachykinin receptor 1 (NK1) | tachykinin
Type:
G Protein-Coupled Receptor (GPCR)
Mol. Mass.:
46254.43
Organism:
Homo sapiens (Human)
Description:
P25103
Residue:
407
  
Inhibitor
Name:
BDBM50101416
Synonyms:
CHEMBL307488 [2-(1H-Indol-3-yl)-1-methyl-1-(1-phenyl-ethylcarbamoyl)-ethyl]-carbamic acid benzofuran-2-ylmethyl ester
Type:
Small organic molecule
Emp. Form.:
C30H29N3O4
Mol. Mass.:
495.569
SMILES:
C[C@H](NC(=O)[C@@](C)(Cc1c[nH]c2ccccc12)NC(=O)OCc1cc2ccccc2o1)c1ccccc1
: