Target
Kappa-type opioid receptor
Ligand
BDBM50101617
Substrate
Meas. Tech.
ChEMBL_147230 (CHEMBL754918)
IC50
4.1±n/a nM
Citation
 Pagé, DNaismith, ASchmidt, RCoupal, MLabarre, MGosselin, MBellemare, DPayza, KBrown, W Novel C-terminus modifications of the Dmt-Tic motif: a new class of dipeptide analogues showing altered pharmacological profiles toward the opioid receptors. J Med Chem 44:2387-90 (2001)  
Target
Name:
Kappa-type opioid receptor
Synonyms:
K-OR-1 Kappa-opioid receptor (KOR) Kappa-type opioid receptor (KOR) OPIATE Kappa OPRK1 kappa opioid receptor (KOR)
Type:
G Protein-Coupled Receptor (GPCR)
Mol. Mass.:
42648.76
Organism:
Homo sapiens (Human)
Description:
P41145
Residue:
380
  
Inhibitor
Name:
BDBM50101617
Synonyms:
1-Adamantan-1-yl-3-{2-[2-amino-3-(4-hydroxy-2,6-dimethyl-phenyl)-propionyl]-1,2,3,4-tetrahydro-isoquinolin-3-ylmethyl}-urea | CHEMBL77804
Type:
Small organic molecule
Emp. Form.:
C32H42N4O3
Mol. Mass.:
530.7009
SMILES:
Cc1cc(O)cc(C)c1C[C@H](N)C(=O)N1Cc2ccccc2C[C@H]1CNC(=O)NC12CC3CC(CC(C3)C1)C2
: