Target
P2X purinoceptor 7
Ligand
BDBM50417267
Substrate
Meas. Tech.
ChEMBL_1993526 (CHEMBL4627421)
IC50
16±n/a nM
Citation
 Homerin, GJawhara, SDezitter, XBaudelet, DDufrénoy, PRigo, BMillet, RFurman, CRagé, GLipka, EFarce, ARenault, NSendid, BCharlet, RLeroy, JPhanithavong, MRicheval, CWiart, JFAllorge, DAdriouch, SVouret-Craviari, VGhinet, A Pyroglutamide-Based P2X7 Receptor Antagonists Targeting Inflammatory Bowel Disease. J Med Chem 63:2074-2094 (2020)  
Target
Name:
P2X purinoceptor 7
Synonyms:
ATP receptor P2RX7_HUMAN P2X purinoceptor 7 (P2X7) P2Z receptor | Purinergic receptor
Type:
Protein
Mol. Mass.:
68602.85
Organism:
Homo sapiens (Human)
Description:
Q99572
Residue:
595
  
Inhibitor
Name:
BDBM50417267
Synonyms:
CHEMBL1271768
Type:
Small organic molecule
Emp. Form.:
C13H12ClF3N2O3
Mol. Mass.:
336.694
SMILES:
CN1[C@@H](COC1=O)C(=O)NCc1cccc(c1Cl)C(F)(F)F
: