Target
Histone-lysine N-methyltransferase SETD7
Ligand
BDBM50049391
Substrate
Meas. Tech.
ChEMBL_1994359 (CHEMBL4628254)
IC50
>200000±n/a nM
Citation
 Min, WHou, ZZhang, FXie, SYuan, KDong, HWang, LQi, LLuo, CDing, HYang, P Computational discovery and biological evaluation of novel inhibitors targeting histone-lysine N-methyltransferase SET7. Bioorg Med Chem 28:0 (2020)  
Target
Name:
Histone-lysine N-methyltransferase SETD7
Synonyms:
Histone-lysine N-methyltransferase SETD7 KMT7 SET7 SETD7 | SETD7_HUMAN
Type:
Enzyme
Mol. Mass.:
40691.12
Organism:
Homo sapiens (Human)
Description:
Q8WTS6
Residue:
366
  
Inhibitor
Name:
BDBM50049391
Synonyms:
3,5,7-Trihydroxyflavone 3,5,7-trihydroxy-2-phenyl-4H-benzopyran-4-one CHEMBL309490 Galangin (15) cid_5281616 | norizalpinin
Type:
Small organic molecule
Emp. Form.:
C15H10O5
Mol. Mass.:
270.2369
SMILES:
Oc1cc(O)c2c(c1)oc(-c1ccccc1)c(O)c2=O
: