Target
Histone-lysine N-methyltransferase EZH1
Ligand
BDBM23411
Substrate
Meas. Tech.
ChEMBL_1994360 (CHEMBL4628255)
IC50
8770±n/a nM
Citation
 Min, WHou, ZZhang, FXie, SYuan, KDong, HWang, LQi, LLuo, CDing, HYang, P Computational discovery and biological evaluation of novel inhibitors targeting histone-lysine N-methyltransferase SET7. Bioorg Med Chem 28:0 (2020)  
Target
Name:
Histone-lysine N-methyltransferase EZH1
Synonyms:
ENX-2 EZH1_HUMAN Enhancer of zeste homolog 1 (EZH1) KIAA0388
Type:
Protein
Mol. Mass.:
85285.34
Organism:
Homo sapiens (Human)
Description:
Q92800
Residue:
747
  
Inhibitor
Name:
BDBM23411
Synonyms:
5,6,7-trihydroxy-2-(4-hydroxyphenyl)-4H-chromen-4-one Scutellarein Scutellarein (28) | US10252984, Table 2.2
Type:
flavone
Emp. Form.:
C15H10O6
Mol. Mass.:
286.2363
SMILES:
Oc1ccc(cc1)-c1cc(=O)c2c(O)c(O)c(O)cc2o1
: