Target
Phenylethanolamine N-methyltransferase
Ligand
BDBM13017
Substrate
Meas. Tech.
ChEMBL_153305 (CHEMBL761982)
Ki
560.0±n/a nM
Citation
 Grunewald, GLCaldwell, TMLi, QCriscione, KR Synthesis and evaluation of 4-fluoro-8-substituted-2,3,4,5-tetrahydro-1H-2-benzazapines as selective inhibitors of phenylethanolamine N-methyltransferase versus the alpha(2)-adrenoceptor. J Med Chem 44:2849-56 (2001)  
Target
Name:
Phenylethanolamine N-methyltransferase
Synonyms:
Noradrenaline N-methyltransferase PNMT_BOVIN | PNMTase
Type:
Enzyme
Mol. Mass.:
30916.97
Organism:
Bos taurus (bovine)
Description:
Residue:
283
  
Inhibitor
Name:
BDBM13017
Synonyms:
1,2,3,4-tetrahydroisoquinoline-7-sulfonamide SKF 29661
Type:
Small organic molecule
Emp. Form.:
C9H12N2O2S
Mol. Mass.:
212.269
SMILES:
NS(=O)(=O)c1ccc2CCNCc2c1
: