Target
Interstitial collagenase
Ligand
BDBM50103098
Substrate
Meas. Tech.
ChEBML_105944
Ki
27±n/a nM
Citation
 Musso, DLAndersen, MWAndrews, RCAustin, RBeaudet, EJBecherer, JDBubacz, DGBickett, DMChan, JHConway, JGCowan, DJGaul, MDGlennon, KCHedeen, KMLambert, MHLeesnitzer, MAMcDougald, DLMitchell, JLMoss, MLRabinowitz, MHRizzolio, MCSchaller, LTStanford, JBTippin, TWarner, JRWhitesell, LGWiethe, RW N-hydroxyformamide peptidomimetics as TACE/matrix metalloprotease inhibitors: oral activity via P1' isobutyl substitution. Bioorg Med Chem Lett 11:2147-51 (2001)  
Target
Name:
Interstitial collagenase
Synonyms:
CLG MMP1 Matrix metalloproteinase-1 | Matrix metalloproteinase-1 (MMP-1)
Type:
Enzyme
Mol. Mass.:
54010.26
Organism:
Homo sapiens (Human)
Description:
P03956
Residue:
469
  
Inhibitor
Name:
BDBM50103098
Synonyms:
(R)-2-[(S)-1-(Formyl-hydroxy-amino)-ethyl]-4-methyl-pentanoic acid [2,2-dimethyl-1-(thiazol-2-ylcarbamoyl)-propyl]-amide | CHEMBL68553
Type:
Small organic molecule
Emp. Form.:
C18H30N4O4S
Mol. Mass.:
398.52
SMILES:
CC(C)C[C@H]([C@H](C)N(O)C=O)C(=O)N[C@H](C(=O)Nc1nccs1)C(C)(C)C
: