Target
Disintegrin and metalloproteinase domain-containing protein 17
Ligand
BDBM50103101
Substrate
Meas. Tech.
ChEBML_207455
Ki
31±n/a nM
Citation
 Musso, DLAndersen, MWAndrews, RCAustin, RBeaudet, EJBecherer, JDBubacz, DGBickett, DMChan, JHConway, JGCowan, DJGaul, MDGlennon, KCHedeen, KMLambert, MHLeesnitzer, MAMcDougald, DLMitchell, JLMoss, MLRabinowitz, MHRizzolio, MCSchaller, LTStanford, JBTippin, TWarner, JRWhitesell, LGWiethe, RW N-hydroxyformamide peptidomimetics as TACE/matrix metalloprotease inhibitors: oral activity via P1' isobutyl substitution. Bioorg Med Chem Lett 11:2147-51 (2001)  
Target
Name:
Disintegrin and metalloproteinase domain-containing protein 17
Synonyms:
ADA17_HUMAN CSVP Disintegrin and metalloproteinase domain-containing protein 17 (ADAM17) TNF-alpha convertase TNF-alpha-converting enzyme (TACE) Tumor necrosis factor-α converting enzyme (TACE)
Type:
Enzyme
Mol. Mass.:
93007.89
Organism:
Homo sapiens (Human)
Description:
Residue:
824
  
Inhibitor
Name:
BDBM50103101
Synonyms:
(2R,3S)-3-(Formyl-hydroxy-amino)-2-isobutyl-pentanoic acid [(S)-2-methyl-1-(pyridin-2-ylcarbamoyl)-butyl]-amide | CHEMBL68667
Type:
Small organic molecule
Emp. Form.:
C21H34N4O4
Mol. Mass.:
406.5191
SMILES:
CCC(C)[C@H](NC(=O)[C@H](CC(C)C)[C@H](CC)N(O)C=O)C(=O)Nc1ccccn1
: