Target
Interstitial collagenase
Ligand
BDBM50103097
Substrate
Meas. Tech.
ChEBML_105944
Ki
16±n/a nM
Citation
 Musso, DLAndersen, MWAndrews, RCAustin, RBeaudet, EJBecherer, JDBubacz, DGBickett, DMChan, JHConway, JGCowan, DJGaul, MDGlennon, KCHedeen, KMLambert, MHLeesnitzer, MAMcDougald, DLMitchell, JLMoss, MLRabinowitz, MHRizzolio, MCSchaller, LTStanford, JBTippin, TWarner, JRWhitesell, LGWiethe, RW N-hydroxyformamide peptidomimetics as TACE/matrix metalloprotease inhibitors: oral activity via P1' isobutyl substitution. Bioorg Med Chem Lett 11:2147-51 (2001)  
Target
Name:
Interstitial collagenase
Synonyms:
CLG MMP1 Matrix metalloproteinase-1 | Matrix metalloproteinase-1 (MMP-1)
Type:
Enzyme
Mol. Mass.:
54010.26
Organism:
Homo sapiens (Human)
Description:
P03956
Residue:
469
  
Inhibitor
Name:
BDBM50103097
Synonyms:
(2R,3S)-3-(Formyl-hydroxy-amino)-2-isobutyl-pentanoic acid [2,2-dimethyl-1-(thiazol-2-ylcarbamoyl)-propyl]-amide | CHEMBL304295
Type:
Small organic molecule
Emp. Form.:
C19H32N4O4S
Mol. Mass.:
412.547
SMILES:
CC[C@@H]([C@@H](CC(C)C)C(=O)N[C@H](C(=O)Nc1nccs1)C(C)(C)C)N(O)C=O
: