Target
Glucocorticoid receptor
Ligand
BDBM50103246
Substrate
Meas. Tech.
ChEMBL_71404 (CHEMBL680190)
Ki
2.10±n/a nM
Citation
 Coghlan, MJKym, PRElmore, SWWang, AXLuly, JRWilcox, DStashko, MLin, CWMiner, JTyree, CNakane, MJacobson, PLane, BC Synthesis and characterization of non-steroidal ligands for the glucocorticoid receptor: selective quinoline derivatives with prednisolone-equivalent functional activity. J Med Chem 44:2879-85 (2001)  
Target
Name:
Glucocorticoid receptor
Synonyms:
GCR_HUMAN GRL Glucocorticoid receptor (GRFP) Nuclear receptor subfamily 3 group C member 1
Type:
Enzyme
Mol. Mass.:
85656.87
Organism:
Homo sapiens (Human)
Description:
P04150
Residue:
777
  
Inhibitor
Name:
BDBM50103246
Synonyms:
10-Methoxy-2,2,4-trimethyl-5-phenyl-2,5-dihydro-1H-6-oxa-1-aza-chrysene | CHEMBL99046
Type:
Small organic molecule
Emp. Form.:
C26H25NO2
Mol. Mass.:
383.4822
SMILES:
COc1cccc2OC(c3ccccc3)c3c(ccc4NC(C)(C)C=C(C)c34)-c12
: