Target
Thyroid hormone receptor alpha
Ligand
BDBM18860
Substrate
Meas. Tech.
ChEMBL_1995747 (CHEMBL4629642)
EC50
3.4±n/a nM
Citation
 Gellrich, LHeitel, PHeering, JKilu, WPollinger, JGoebel, TKahnt, AArifi, SPogoda, WPaulke, ASteinhilber, DProschak, EWurglics, MSchubert-Zsilavecz, MChaikuad, AKnapp, SBischoff, IFürst, RMerk, D l-Thyroxin and the Nonclassical Thyroid Hormone TETRAC Are Potent Activators of PPAR?. J Med Chem 63:6727-6740 (2020)  
Target
Name:
Thyroid hormone receptor alpha
Synonyms:
C-erbA-alpha EAR7 NR1A1 THA_HUMAN THRA1 Thyroid Hormone Receptor (TR-alpha) Thyroid hormone receptor alpha c-erbA-1
Type:
Receptor
Mol. Mass.:
54818.00
Organism:
Homo sapiens (Human)
Description:
Recombinant hThR was obtained from nuclear extracts from SF9 cells infected with baculovirus vectors encoding for ThRalpha 1.
Residue:
490
  
Inhibitor
Name:
BDBM18860
Synonyms:
(2R)-2-amino-3-[4-(4-hydroxy-3-iodophenoxy)-3,5-diiodophenyl]propanoic acid 3,5,3'-triiodo-L-thyronine (T3) Triiodothyronine US10544075, Compound T3 liothyronine | triothyrone
Type:
Hormone
Emp. Form.:
C15H12I3NO4
Mol. Mass.:
650.9735
SMILES:
N[C@@H](Cc1cc(I)c(Oc2ccc(O)c(I)c2)c(I)c1)C(O)=O
: